{"text_format":"1","workbook":"xlsx","n_sheets":22,"sheets":["PANELPRINCIPAL","PLIQUIDACION","Hoja2","Hoja9","MPURBANA","Hoja4","Hoja10","MPINTER","Hoja7","MODURBANA","Hoja8","MODINTER","EMPLEADOS","CIF","LD","Hoja3","INFORMES","CONMPU","CONMPI","Hoja6","CONSOLIDADO","GRAFICAS"],"not_rendered":{"charts":1,"images":23,"macros":1,"external_links":0,"defined_names":2,"comments":0,"pivot_tables":8},"unopened":[],"bounds":{"document_bytes":16777216,"sheet_cells":100000,"rows_first":2000,"rows_last":500,"rows_between":2000,"halvings":0,"cell_chars":16384,"cell_head_chars":4096},"cells_cut":0,"cells_raw":0,"read":"whole","date_system":"1900"}

{"sheet":"PANELPRINCIPAL","index":0,"n_rows":3,"n_cols":8,"rows_kept":3,"cut":false,"hidden":false,"merged":[[0,0,0,10],[1,0,1,10],[2,1,2,4],[2,7,2,10]]}
["MODELO DE COSTOS ABC "]
["PANEL PRINCIPAL"]
[null,"CONSULTAS",null,null,null,null,null,"LIQUIDACION"]

{"sheet":"PLIQUIDACION","index":1,"n_rows":20,"n_cols":55,"rows_kept":20,"cut":false,"hidden":false,"merged":[[11,3,11,5],[15,0,19,3],[19,5,19,6],[0,0,1,8],[5,0,5,2],[5,3,5,5],[7,0,7,2],[7,3,7,5],[9,0,9,2],[9,3,9,5],[3,0,3,7],[15,5,15,6],[16,5,16,6],[17,5,17,6],[18,5,18,6],[11,0,11,2]]}
["PANEL DE LIQUIDACION"]
[]
[]
["SELECCIONE LAS CONDICIONES DE LA CARROCERIA A LIQUIDAR"]
[]
["TIPO DE CARROCERIA",null,null,"INTERMUNICIPAL",null,null,null,"URBANA"]
[null,null,null,null,null,null,null,"INTERMUNICIPAL"]
["TIPO DE TECHO",null,null,"FIBRA",null,null,null,null,"FIBRA","FORRADO"]
[]
["TIPO DE PISO",null,null,"HULE",null,null,null,null,"HULE","LAMINA"]
{"$rows_left_out":11}
{"sheet":"Hoja2","index":2,"n_rows":94,"n_cols":5,"rows_kept":94,"cut":false,"hidden":true,"merged":[]}
[]
[]
["Suma de VALOR TOTAL","Rótulos de columna"]
["Rótulos de fila","Directo","Indirecto","(en blanco)","Total general"]
[" FRENTES Y TRACEROS EN FIBRA DE VIDRIO",1560000,1213800,0,2773800]
["Adecuación de las partes montadas",null,4000,null,4000]
["Desmonte de partes de los moldes ",null,null,0,0]
["Elaboración de piezas de frente en fibra de vidrio ",780000,412050,null,1192050]
["Elaboración de piezas traseras en fibra de vidrio ",780000,397050,null,1177050]
["Encerar los  moldes ",null,390000,null,390000]
{"$rows_left_out":85}
{"sheet":"Hoja9","index":3,"n_rows":19,"n_cols":5,"rows_kept":19,"cut":false,"hidden":true,"merged":[]}
[]
[]
["Suma de VALOR TOTAL","Rótulos de columna"]
["Rótulos de fila","Directo","Indirecto","(en blanco)","Total general"]
[" FRENTES Y TRACEROS EN FIBRA DE VIDRIO",1560000,1213800,0,2773800]
["ADECUACIONES ELÉCTRICAS ",2776935,267790,null,3044725]
["ALISTAMIENTO CHASIS",null,116100,null,116100]
["DECORACION ( PISO EN HULE)",652374,60867.033333333326,0,713241.03333333333]
["DECORACION ( PISO EN LAMINA)",665000,121033.7,0,786033.7]
["DECORACION ( TECHO FIBRA)",998000,587250,null,1585250]
{"$rows_left_out":10}
{"sheet":"MPURBANA","index":4,"n_rows":241,"n_cols":8,"rows_kept":241,"cut":false,"hidden":false,"merged":[[15,1,16,1]]}
[]
[]
[]
[]
["PROCESO","ACTIVIDADES","MATERIALES","CANTIDAD \nUTILIZADA","UNIDAD \nDE MEDIDA","VALOR UNITARIO","VALOR TOTAL","CLASIFICACION "]
["ALISTAMIENTO CHASIS","Acondicionamiento de filtro de aire ","Codo metalico 1m*2 1/4",1,"UND",3500,{"$f":"+F6*D6","v":3500},"Indirecto"]
["ALISTAMIENTO CHASIS","Acondicionamiento de filtro de aire ","Manguera de 2 y 3/4",1,"MTS",6000,{"$f":"+F7*D7","v":6000},"Indirecto"]
["ALISTAMIENTO CHASIS","Acondicionamiento de filtro de aire ","Abrazaderas 2 y 3/4",4,"UND",800,3200,"Indirecto"]
["ALISTAMIENTO CHASIS","Acondicionamiento de filtro de aire ","Codo 5 y 1/2 pulgadas",1,"UND",900,900,"Indirecto"]
["ALISTAMIENTO CHASIS","Acondicionamiento de filtro de aire ","Tubo 4 pulgadas",1,"MTS",9700,9700,"Indirecto"]
{"$rows_left_out":232}
{"sheet":"Hoja4","index":5,"n_rows":90,"n_cols":5,"rows_kept":90,"cut":false,"hidden":true,"merged":[]}
[]
[]
["Suma de VALOR TOTAL","Rótulos de columna"]
["Rótulos de fila","Directo","Indirecto",0,"Total general"]
[" FRENTES Y TRACEROS EN FIBRA DE VIDRIO",2319000,738650,0,3057650]
["Adecuación de las partes montadas",null,4000,null,4000]
["Elaboración de piezas de frente en fibra de vidrio ",932000,359300,null,1291300]
["Elaboración de piezas traseras en fibra de vidrio ",932000,359300,null,1291300]
["Encerar los  moldes ",455000,null,null,455000]
["Instalación de las partes ",null,16050,null,16050]
{"$rows_left_out":81}
{"sheet":"Hoja10","index":6,"n_rows":19,"n_cols":5,"rows_kept":19,"cut":false,"hidden":true,"merged":[]}
[]
[]
["Suma de VALOR TOTAL","Rótulos de columna"]
["Rótulos de fila",0,"Directo","Indirecto","Total general"]
[" FRENTES Y TRACEROS EN FIBRA DE VIDRIO",0,2319000,738650,3057650]
["ADECUACIONES ELÉCTRICAS ",null,2852844,281308,3134152]
["ALISTAMIENTO CHASIS",null,null,116100,116100]
["DECORACION ( PISO EN HULE)",null,941419,74246.7,1015665.7]
["DECORACION ( PISO EN LAMINA)",null,906000,151196.70000000001,1057196.7]
["DECORACION ( TECHO FIBRA)",null,1048000,776250,1824250]
{"$rows_left_out":10}
{"sheet":"MPINTER","index":7,"n_rows":238,"n_cols":8,"rows_kept":238,"cut":false,"hidden":false,"merged":[[15,1,16,1]]}
[]
[]
[]
[]
["PROCESOS","ACTIVIDADES","MATERIALES","CANTIDAD \nUTILIZADA","UNIDAD \nDE MEDIDA","VALOR UNITARIO","VALOR TOTAL","CLASIFICACION"]
["ALISTAMIENTO CHASIS","Acondicionamiento de filtro de aire ","Codo metalico 1m*2 1/4",1,"UND",3500,{"$f":"+F6*D6","v":3500},"Indirecto"]
["ALISTAMIENTO CHASIS","Acondicionamiento de filtro de aire ","Manguera de 2 y 3/4",1,"MTS",6000,{"$f":"+F7*D7","v":6000},"Indirecto"]
["ALISTAMIENTO CHASIS","Acondicionamiento de filtro de aire ","Abrazaderas 2 y 3/4",4,"UND",800,3200,"Indirecto"]
["ALISTAMIENTO CHASIS","Acondicionamiento de filtro de aire ","Codo 5 y 1/2 pulgadas",1,"UND",900,900,"Indirecto"]
["ALISTAMIENTO CHASIS","Acondicionamiento de filtro de aire ","1m de tubo 4 pulgadas",1,"MTS",9700,9700,"Indirecto"]
{"$rows_left_out":229}
{"sheet":"Hoja7","index":8,"n_rows":19,"n_cols":2,"rows_kept":19,"cut":false,"hidden":true,"merged":[]}
[]
[]
["Rótulos de fila","Suma de VALOR TOTAL"]
[" FRENTES Y TRACEROS EN FIBRA DE VIDRIO",697446.62750000018]
["ADECUACIONES ELÉCTRICAS ",275496.71750000003]
["ALISTAMIENTO CHASIS",188582.08]
["DECORACION ( PISO EN HULE)",230071.69999999998]
["DECORACION ( PISO EN LAMINA)",109284.0575]
["DECORACION ( TECHO FIBRA)",380246.2]
["DECORACION ( TECHO FORRADO)",143794.8125]
{"$rows_left_out":10}
{"sheet":"MODURBANA","index":9,"n_rows":81,"n_cols":6,"rows_kept":81,"cut":false,"hidden":false,"merged":[[81,1,81,4],[65,2,65,3],[24,2,27,3],[24,4,27,4],[24,5,27,5]]}
[]
[]
[]
[]
["PROCESO","ACTIVIDADES","TIEMPO REQUERIDO\nHORAS HOMBRE","#  \nTRABAJADORES","VALOR HORA","VALOR TOTAL"]
["ALISTAMIENTO CHASIS","Acondicionamiento de filtro de aire ",8,1,{"$f":"EMPLEADOS!K8","v":5751.7924999999996},{"$f":"+E6*C6","v":46014.34}]
["ALISTAMIENTO CHASIS","Acondicionamiento de filtro de combustible",2,1,{"$f":"EMPLEADOS!K10","v":5751.7924999999996},11503.584999999999]
["ALISTAMIENTO CHASIS","Acondicimiento de bateria ",2,1,{"$f":"EMPLEADOS!K10","v":5751.7924999999996},11503.584999999999]
["ALISTAMIENTO CHASIS","Acondicimineto de portarepuestos",4,1,5730.0424999999996,22920.17]
["ALISTAMIENTO CHASIS","Instalación de banda",8,2,{"$f":"+EMPLEADOS!K5+EMPLEADOS!K10","v":12080.05},96640.4]
{"$rows_left_out":72}
{"sheet":"Hoja8","index":10,"n_rows":18,"n_cols":2,"rows_kept":18,"cut":false,"hidden":true,"merged":[]}
[]
[]
["Rótulos de fila","Suma de VALOR TOTAL"]
[" FRENTES Y TRACEROS EN FIBRA DE VIDRIO",697446.62750000018]
["ADECUACIONES ELÉCTRICAS ",286712.06999999995]
["ALISTAMIENTO CHASIS",188669.08]
["DECORACION ( PISO EN HULE)",281837.83249999996]
["DECORACION ( PISO EN LAMINA)",166801.98249999998]
["DECORACION ( TECHO FIBRA)",401530.40375]
["DECORACION ( TECHO FORRADO)",207064.53000000003]
{"$rows_left_out":9}
{"sheet":"MODINTER","index":11,"n_rows":83,"n_cols":6,"rows_kept":83,"cut":false,"hidden":false,"merged":[[82,1,82,4],[66,2,66,3],[25,2,28,3],[25,4,28,4],[25,5,28,5]]}
[]
[]
[]
[]
[]
["PROCESOS","ACTIVIDADES","TIEMPO REQUERIDO\nHORAS HOMBRE","#  \nTRABAJADORES","VALOR HORA","VALOR TOTAL"]
["ALISTAMIENTO CHASIS","Acondicionamiento de filtro de aire ",8,1,{"$f":"EMPLEADOS!$K$8","v":5751.7924999999996},{"$f":"+E7*C7","v":46014.34}]
["ALISTAMIENTO CHASIS","Acondicionamiento de filtro de combustible",2,1,{"$f":"EMPLEADOS!$K$10","v":5751.7924999999996},{"$f":"+E8*C8","v":11503.584999999999}]
["ALISTAMIENTO CHASIS","Acondicimiento de bateria ",2,1,{"$f":"EMPLEADOS!$K$10","v":5751.7924999999996},{"$f":"+E9*C9","v":11503.584999999999}]
["ALISTAMIENTO CHASIS","Acondicimineto de portarepuestos",4,1,{"$f":"EMPLEADOS!$K$10","v":5751.7924999999996},{"$f":"+E10*C10","v":23007.17}]
{"$rows_left_out":74}
{"sheet":"EMPLEADOS","index":12,"n_rows":12,"n_cols":11,"rows_kept":12,"cut":false,"hidden":false,"merged":[]}
["EMPLEADO","CARGO","SUELDO MENSUAL","AUXILIO DE TRANSPORTE","SEGURIDAD SOCIAL","VLR HORA SUELDO","VLR HORA PRIMA","VLR HORA CESANTIAS","VLR HORA INTERESES ","VL HORA VACACIONES","VALOR HORA DE TRABAJO"]
["NEMECIO","JEFE DE PRODUCCION",{"$f":"1360000-D2","v":1360000},0,{"$f":"+(((C2+D2)/240)*16.522%)","v":936.24666666666656},{"$f":"(+C2+D2)/240","v":5666.666666666667},{"$f":"((((+C2+D2)*8.33%)/240))","v":472.03333333333336},{"$f":"+((((C2+D2)*8.33%)/240))","v":472.03333333333336},{"$f":"+H2*12%","v":56.643999999999998},{"$f":"(+C2*4.17%)/240","v":236.3},{"$f":"SUM(E2:J2)","v":7839.9240000000018}]
["JOSE RATIVA","ELECTRICO Y FIBRA DE VIDRIO",{"$f":"950000-D3","v":876000},74000,{"$f":"+(((C3+D3)/240)*16.522%)","v":653.99583333333328},{"$f":"(+C3+D3)/240","v":3958.3333333333335},{"$f":"((((+C3+D3)*8.33%)/240))","v":329.72916666666669},{"$f":"+((((C3+D3)*8.33%)/240))","v":329.72916666666669},{"$f":"+H3*12%","v":39.567500000000003},{"$f":"(+C3*4.17%)/240","v":152.20500000000001},{"$f":"SUM(E3:J3)","v":5463.56}]
["ALBERTO CASTIBLANCO","FIBRA DE VIDRIO- PLATAFORMA",{"$f":"1100000-D4","v":1026000},74000,757.25833333333321,4583.333333333333,381.79166666666669,381.79166666666669,45.814999999999998,178.26750000000001,6328.2574999999997]
["ORLANDO GUIO","PLATAFORMA Y ESTRUCTURA",{"$f":"1100000-D5","v":1026000},74000,757.25833333333321,4583.333333333333,381.79166666666669,381.79166666666669,45.814999999999998,178.26750000000001,6328.2574999999997]
["LUIS GONZALEZ","PINTURA",{"$f":"950000-D6","v":876000},74000,653.99583333333328,3958.3333333333335,329.72916666666669,329.72916666666669,39.567500000000003,152.20500000000001,5463.56]
["HERMES ZABALA","PINTURA",{"$f":"1000000-D7","v":926000},74000,688.41666666666663,4166.666666666667,347.08333333333331,347.08333333333331,41.65,160.89250000000001,5751.7924999999996]
["ALEXANDER PEÑA","SILLETERIA Y PLATAFORMA",{"$f":"1000000-D8","v":926000},74000,688.41666666666663,4166.666666666667,347.08333333333331,347.08333333333331,41.65,160.89250000000001,5751.7924999999996]
["ADELMO SILVA","PLATAFORMA Y ENLATADO Y DECORACION",{"$f":"1000000-D9","v":926000},74000,688.41666666666663,4166.666666666667,347.08333333333331,347.08333333333331,41.65,160.89250000000001,5751.7924999999996]
["FELIPE CASTRO","ALISTAMIENTO DE CHASIS  Y  DECORACION",{"$f":"1000000-D10","v":926000},74000,688.41666666666663,{"$f":"(+C10+D10)/240","v":4166.666666666667},{"$f":"((((+C10+D10)*8.33%)/240))","v":347.08333333333331},{"$f":"+((((C10+D10)*8.33%)/240))","v":347.08333333333331},41.65,{"$f":"(+C10*4.17%)/240","v":160.89250000000001},{"$f":"SUM(E10:J10)","v":5751.7924999999996}]
{"$rows_left_out":3}
{"sheet":"CIF","index":13,"n_rows":39,"n_cols":12,"rows_kept":39,"cut":false,"hidden":false,"merged":[[14,0,14,11]]}
["PROCESO","SALARIOS ADMINISTRATIVOS","SALARIO JEFE DE PRODUCCION","ARRENDAMIENTO","DEPRECIACION CORTADORA","DEPRECIACION DOBLADORA","ENERGIA ELECTRICA ","ACUEDUCTO","ALCANTARILLADO","TELEFONIA ","INTERNET"]
["ALISTAMIENTO DE CHASIS ",0.05,2.4,12,null,null,39.92,0]
["PLATAFORMA Y ESTRUCTURA ",0.05,18,20,0.8,0.8,329.34000000000003]
["ENLATADO",0.05,9.6,12,null,null,69.860000000000014]
[" FRENTES Y TRACEROS EN FIBRA DE VIDRIO",0.05,12,20,null,null,59.879999999999995,25.5,10.5]
["ESTRIBOS, PUERTAS Y BODEGAS ",0.05,1.2,9,null,null,69.860000000000014,null,0]
["PINTURA",0.05,8.4,13,null,null,59.879999999999995,51,21]
["DECORACIÓN",0.05,36,10,0.2,0.2,99.800000000000011,null,0]
["ADECUACIONES ELÉCTRICAS ",0.05,14.399999999999999,12,null,null,59.879999999999995,null,0]
["MANTENIMIENTO ",0.05,7.1999999999999993,7,null,null,49.900000000000006,51,21]
{"$rows_left_out":30}
{"sheet":"LD","index":14,"n_rows":4,"n_cols":1,"rows_kept":4,"cut":false,"hidden":true,"merged":[]}
[]
["TIPO DE CARROCERIAS"]
["URBANA "]
["INTERMUNICIPAL"]

{"sheet":"Hoja3","index":15,"n_rows":0,"n_cols":0,"rows_kept":0,"cut":false,"hidden":true,"merged":[]}

{"sheet":"INFORMES","index":16,"n_rows":83,"n_cols":14,"rows_kept":83,"cut":false,"hidden":false,"merged":[[0,0,1,12],[4,0,8,0],[9,0,14,0],[15,0,16,0],[66,0,73,0],[74,0,76,0],[23,8,27,8],[77,0,80,0],[2,9,2,11],[28,0,37,0],[38,0,42,0],[43,0,54,0],[55,0,58,0],[59,0,61,0],[62,0,65,0],[23,0,27,0],[17,0,22,0]]}
["INFORME DE COSTEO  POR ABC "]
[]
[null,null,null,null,null,null,null,null,null,"COSTOS INDIRECTOS DE FABRICACION"]
["FASES EN EL PROCESO PRODUCTIVO","ACTIVIDADES","TIPPO CARROCERIA","VARIABLE 2","MPD","MOD","MID","MATERIALES DIRECTOS","MANO DE OBRA DIRECTA","MPI","MOI","OTROS CIF","TOTAL COSTOS","PROCESO"]
["ALISTAMIENTO DE CHASIS ","Acondicionamiento de filtro de aire ",{"$f":"IF(PLIQUIDACION!$D$6=\"URBANA\",\"URBANA\",\"INTERMUNICIPAL\")","v":"INTERMUNICIPAL"},null,null,null,null,{"$f":"IF(INFORMES!C5=\"URBANA\",VLOOKUP(B5,CONMPU!$A$1:$E$91,2,FALSE),VLOOKUP(INFORMES!B5,CONMPI!$A$1:$D$93,2,FALSE))","v":0},{"$f":"IF(C5=\"URBANA\",VLOOKUP(B5,MODURBANA!$B$6:$F$81,5,FALSE),VLOOKUP(B5,MODINTER!$B$7:$F$82,5,FALSE))","v":46014.34},{"$f":"IF(INFORMES!C5=\"URBANA\",VLOOKUP(B5,CONMPU!$A$1:$E$91,3,FALSE),VLOOKUP(INFORMES!B5,CONMPI!$A$1:$D$93,3,FALSE))","v":34100},{"$f":"+CIF!B17+CIF!C17","v":143203.59680000003},{"$f":"+CIF!D17+CIF!E17+CIF!F17+CIF!G17+CIF!H17+CIF!I17+CIF!J17+CIF!K17","v":123587.952},{"$f":"+H5+I5+J5+K5+L5","v":346905.88880000002},"ALISTAMIENTO CHASIS"]
[null,"Acondicionamiento de filtro de combustible",{"$f":"IF(PLIQUIDACION!$D$6=\"URBANA\",\"URBANA\",\"INTERMUNICIPAL\")","v":"INTERMUNICIPAL"},null,null,null,null,{"$f":"IF(INFORMES!C6=\"URBANA\",VLOOKUP(B6,CONMPU!$A$1:$E$91,2,FALSE),VLOOKUP(INFORMES!B6,CONMPI!$A$1:$D$93,2,FALSE))","v":0},{"$f":"IF(C6=\"URBANA\",VLOOKUP(B6,MODURBANA!$B$6:$F$81,5,FALSE),VLOOKUP(B6,MODINTER!$B$7:$F$82,5,FALSE))","v":11503.584999999999},{"$f":"IF(INFORMES!C6=\"URBANA\",VLOOKUP(B6,CONMPU!$A$1:$E$91,3,FALSE),VLOOKUP(INFORMES!B6,CONMPI!$A$1:$D$93,3,FALSE))","v":0},null,null,{"$f":"+H6+I6+J6+K6+L6","v":11503.584999999999},"ALISTAMIENTO CHASIS"]
[null,"Acondicimiento de bateria ",{"$f":"IF(PLIQUIDACION!$D$6=\"URBANA\",\"URBANA\",\"INTERMUNICIPAL\")","v":"INTERMUNICIPAL"},null,null,null,null,{"$f":"IF(INFORMES!C7=\"URBANA\",VLOOKUP(B7,CONMPU!$A$1:$E$91,2,FALSE),VLOOKUP(INFORMES!B7,CONMPI!$A$1:$D$93,2,FALSE))","v":0},{"$f":"IF(C7=\"URBANA\",VLOOKUP(B7,MODURBANA!$B$6:$F$81,5,FALSE),VLOOKUP(B7,MODINTER!$B$7:$F$82,5,FALSE))","v":11503.584999999999},{"$f":"IF(INFORMES!C7=\"URBANA\",VLOOKUP(B7,CONMPU!$A$1:$E$91,3,FALSE),VLOOKUP(INFORMES!B7,CONMPI!$A$1:$D$93,3,FALSE))","v":0},null,null,11503.584999999999,"ALISTAMIENTO CHASIS"]
[null,"Acondicimineto de portarepuestos",{"$f":"IF(PLIQUIDACION!$D$6=\"URBANA\",\"URBANA\",\"INTERMUNICIPAL\")","v":"INTERMUNICIPAL"},null,null,null,null,{"$f":"IF(INFORMES!C8=\"URBANA\",VLOOKUP(B8,CONMPU!$A$1:$E$91,2,FALSE),VLOOKUP(INFORMES!B8,CONMPI!$A$1:$D$93,2,FALSE))","v":0},{"$f":"IF(C8=\"URBANA\",VLOOKUP(B8,MODURBANA!$B$6:$F$81,5,FALSE),VLOOKUP(B8,MODINTER!$B$7:$F$82,5,FALSE))","v":23007.17},{"$f":"IF(INFORMES!C8=\"URBANA\",VLOOKUP(B8,CONMPU!$A$1:$E$91,3,FALSE),VLOOKUP(INFORMES!B8,CONMPI!$A$1:$D$93,3,FALSE))","v":0},null,null,23007.17,"ALISTAMIENTO CHASIS"]
[null,"Instalación de banda",{"$f":"IF(PLIQUIDACION!$D$6=\"URBANA\",\"URBANA\",\"INTERMUNICIPAL\")","v":"INTERMUNICIPAL"},null,null,null,null,{"$f":"IF(INFORMES!C9=\"URBANA\",VLOOKUP(B9,CONMPU!$A$1:$E$91,2,FALSE),VLOOKUP(INFORMES!B9,CONMPI!$A$1:$D$93,2,FALSE))","v":0},{"$f":"IF(C9=\"URBANA\",VLOOKUP(B9,MODURBANA!$B$6:$F$81,5,FALSE),VLOOKUP(B9,MODINTER!$B$7:$F$82,5,FALSE))","v":96640.4},{"$f":"IF(INFORMES!C9=\"URBANA\",VLOOKUP(B9,CONMPU!$A$1:$E$91,3,FALSE),VLOOKUP(INFORMES!B9,CONMPI!$A$1:$D$93,3,FALSE))","v":32000},null,null,128640.4,"ALISTAMIENTO CHASIS"]
["PLATAFORMA Y ESTRUCTURA ","Cortar Lámina ",{"$f":"IF(PLIQUIDACION!$D$6=\"URBANA\",\"URBANA\",\"INTERMUNICIPAL\")","v":"INTERMUNICIPAL"},null,null,null,null,{"$f":"IF(INFORMES!C10=\"URBANA\",VLOOKUP(B10,CONMPU!$A$81:$E$86,2,FALSE),VLOOKUP(INFORMES!B10,CONMPI!$A$83:$D$88,2,FALSE))","v":345000},{"$f":"IF(C10=\"URBANA\",VLOOKUP(B10,MODURBANA!$B$6:$F$81,5,FALSE),VLOOKUP(B10,MODINTER!$B$7:$F$82,5,FALSE))","v":113908.63499999999},{"$f":"IF(INFORMES!C10=\"URBANA\",VLOOKUP(B10,CONMPU!$A$1:$E$91,3,FALSE),VLOOKUP(INFORMES!B10,CONMPI!$A$1:$D$93,3,FALSE))","v":0},{"$f":"+CIF!B18+CIF!C18","v":222731.85920000001},{"$f":"+CIF!D18+CIF!E18+CIF!F18+CIF!G18+CIF!H18+CIF!I18+CIF!J18+CIF!K18","v":772400.60400000005},1454041.0982000001,"PLATAFORMA Y ESTRUCTURA"]
{"$rows_left_out":74}
{"sheet":"CONMPU","index":17,"n_rows":92,"n_cols":5,"rows_kept":92,"cut":false,"hidden":true,"merged":[]}
[" FRENTES Y TRACEROS EN FIBRA DE VIDRIO",1560000,1213800,0,2773800]
["Adecuación de las partes montadas",0,4000,null,4000]
["Desmonte de partes de los moldes ",null,null,0,0]
["Elaboración de piezas de frente en fibra de vidrio ",780000,412050,null,1192050]
["Elaboración de piezas traseras en fibra de vidrio ",780000,397050,null,1177050]
["Encerar los  moldes ",null,390000,null,390000]
["Instalación de las partes ",null,10700,null,10700]
["ADECUACIONES ELÉCTRICAS ",2656935,267790,null,2924725]
["Adecuación de alumbrado interno ",232500,17000,null,249500]
["Adecuación de Boster",750000,161200,null,911200]
{"$rows_left_out":83}
{"sheet":"CONMPI","index":18,"n_rows":93,"n_cols":4,"rows_kept":93,"cut":false,"hidden":true,"merged":[]}
["Rótulos de fila","Directo","Indirecto","Total general"]
[" FRENTES Y TRACEROS EN FIBRA DE VIDRIO",2319000,738650,3057650]
["Adecuación de las partes montadas",null,4000,4000]
["Elaboración de piezas de frente en fibra de vidrio ",932000,359300,1291300]
["Elaboración de piezas traseras en fibra de vidrio ",932000,359300,1291300]
["Encerar los  moldes ",455000,null,455000]
["Instalación de las partes ",null,16050,16050]
["Desmonte de partes de los moldes ",0,0,0]
["ADECUACIONES ELÉCTRICAS ",2732844,281308,3014152]
["Adecuación de alumbrado interno ",1055500,23700,1079200]
{"$rows_left_out":84}
{"sheet":"Hoja6","index":19,"n_rows":7,"n_cols":14,"rows_kept":7,"cut":false,"hidden":true,"merged":[]}
[null,null,null,null,null,null,null,null,null,null,"URB+FOR","URB+FI","INTER+FO","INTER+FI"]
[null,null,null,null,null,null,null,null,"URBANA",0,{"$f":"+J2+J4","v":2},{"$f":"+J2+J5","v":3}]
["TIPO CARROCERIA","INTERMUNICIPAL",null,null,null,null,null,null,"INTERMUNICIPAL",1,null,null,{"$f":"+J4+J3","v":3},{"$f":"+J3+J5","v":4}]
["TECHO","FIBRA",null,null,null,null,null,null,"FORRADA",2]
["PISO",null,null,null,null,null,null,null,"FIBRA",3]
[]
[null,null,{"$f":"IF(AND(B3=\"URBANA\",B4=\"FORRADO\"),J2+J4,IF(AND(B3=\"URBANA\",B4=\"FIBRA\"),J2+J5,IF(AND(B3=\"INTERMUNICIPAL\",B4=\"FORRADO\"),J3+J4,IF(AND(B3=\"INTERMUNICIPAL\",B4=\"FIBRA\"),J3+J5,0))))","v":4}]

{"sheet":"CONSOLIDADO","index":20,"n_rows":21,"n_cols":6,"rows_kept":21,"cut":false,"hidden":false,"merged":[[0,0,0,5]]}
["CONSOLIDADO DE COSTOS "]
[]
[null,"Valores"]
["Rótulos de fila","Suma de MATERIALES DIRECTOS","Suma de MANO DE OBRA DIRECTA","Suma de MPI","Suma de MOI","Suma de OTROS CIF"]
["ADECUACIONES ELECTRICAS",2764000,275208.48499999999,281308,207213.59120000002,132581.92800000001]
["ALISTAMIENTO CHASIS",0,188669.08,66100,143203.59680000003,123587.952]
["DECORACION GENERAL",391000,56653.227500000008,214500,331452.30920000002,244969.88]
["DECORACION PISO HULE",941419,281837.83249999996,74246.7]
["DECORACION PISO LAMINA",0,0,0]
["DECORACION TECHO FIBRA",1048000,401530.40375,969250]
{"$rows_left_out":12}
{"sheet":"GRAFICAS","index":21,"n_rows":0,"n_cols":0,"rows_kept":0,"cut":false,"hidden":false,"merged":[]}